{"text_format":"1","workbook":"xlsx","n_sheets":25,"sheets":["Legend","1. Agency Information","2. Revenue","3. Providers","4. Non-Providers","5. Cost Information","6. Reclass Template","7. Adjustment Template","8. Other Information","Cost Breakdown","Form 1 - Direct Medical Cost","Form 2 - Direct Dental Cost","Form 3 - Direct BH Cost","Form 4 - NonAllowable","Form 5 - Overhead & Enabling","Form 6A - Reclassification","Form 6B - Adjustments","Form 7 - Visits by FTE","Form A - Allocations","Form B - Cost per Visit","Tab 9. Reconciliation","Tab 10. Accuracy of Report","Flat Data Tab","Provider List","System Data"],"not_rendered":{"charts":0,"images":1,"macros":1,"external_links":0,"defined_names":344,"comments":0,"pivot_tables":0},"unopened":[],"bounds":{"document_bytes":16777216,"sheet_cells":100000,"rows_first":2000,"rows_last":500,"rows_between":2000,"halvings":0,"cell_chars":16384,"cell_head_chars":4096},"cells_cut":0,"cells_raw":0,"read":"whole","date_system":"1900"}

{"sheet":"Legend","index":0,"n_rows":9,"n_cols":3,"rows_kept":9,"cut":false,"hidden":false,"merged":[[38,1,38,2],[1,1,1,8],[2,1,2,8],[3,1,4,8],[29,1,29,2],[30,1,30,2],[31,1,31,2],[33,1,33,2],[34,1,34,2],[35,1,35,2],[26,1,26,2],[27,1,27,2],[37,1,37,2]]}
[]
[null,"2023 Community Health Center Cost Report"]
[null,"Legend"]
[null,"Select your Clinic Name in Tab 1, Cell C8"]
[]
[]
[]
[null,null,"Provider Input (Unlocked)"]
[null,null,"Calculated/Populated/Linked (Locked)"]

{"sheet":"1. Agency Information","index":1,"n_rows":42,"n_cols":9,"rows_kept":42,"cut":false,"hidden":false,"merged":[[1,1,1,5],[2,1,2,5],[3,1,3,5]]}
[]
[null,"Community Health Center Cost Report",null,null,null,null,null,null,"Version 7"]
[null,"Tab 1 - Agency Information"]
[null,{"$f":"C9","v":0}]
[]
[]
[null,"Organization"]
["Line"]
[1,"Provider Name"]
[2,"Federal Employee ID Number (FEIN)"]
{"$rows_left_out":33}
{"sheet":"2. Revenue","index":2,"n_rows":62,"n_cols":6,"rows_kept":62,"cut":false,"hidden":false,"merged":[[45,1,45,3],[46,1,46,3],[47,1,47,3],[48,1,48,3],[57,1,57,3],[53,1,53,3],[54,1,54,3],[55,1,55,3],[26,1,26,3],[30,1,30,3],[29,1,29,3],[44,1,44,3],[27,1,27,3],[31,1,31,3],[43,1,43,3],[32,1,32,3],[33,1,33,3],[35,1,35,3],[36,1,36,3],[34,1,34,3],[14,1,14,3],[15,1,15,3],[19,1,19,3],[23,1,23,3],[56,1,56,3],[37,1,37,3],[38,1,38,3],[39,1,39,3],[40,1,40,3],[52,1,52,3],[49,1,49,3],[50,1,50,3],[51,1,51,3],[28,1,28,3],[41,1,41,3],[42,1,42,3],[25,1,25,3],[18,1,18,3],[21,1,21,3],[22,1,22,3],[1,2,1,6],[2,2,2,6],[3,2,3,6],[17,1,17,3],[7,1,7,3],[24,1,24,3],[8,1,8,3],[9,1,9,3],[10,1,10,3],[20,1,20,3],[12,1,12,3],[13,1,13,3]]}
[]
[null,null,"Community Health Center Cost Report"]
[null,null,"Tab 2 - Revenue"]
[null,null,{"$f":"'1. Agency Information'!C9","v":0}]
[]
[]
[]
["Line","A. Third Party Revenues - NPSR",null,null,"Revenue","Total"]
[1,"Medicare"]
[2,"MassHealth - Fee For Service / PCC Plan"]
{"$rows_left_out":53}
{"sheet":"3. Providers","index":3,"n_rows":108,"n_cols":7,"rows_kept":108,"cut":false,"hidden":false,"merged":[[7,2,7,6],[8,2,8,3],[8,4,8,5],[1,1,1,4],[2,1,2,4],[3,1,3,4]]}
[]
[null,"Community Health Center Cost Report"]
[null,"Tab 3 - Providers"]
[null,{"$f":"'1. Agency Information'!C9","v":0}]
[]
[null,"Please see accompanying Instructions document for guidance on data input."]
[]
[null,null,"Staffing"]
[null,"Service Category","Salary or Contractor Expense",null,"Salary or Contractor FTEs",null,"Billable Visits"]
[null,null,"Employee","Contracted","Employee","Contracted"]
{"$rows_left_out":99}
{"sheet":"4. Non-Providers","index":4,"n_rows":317,"n_cols":6,"rows_kept":317,"cut":false,"hidden":false,"merged":[[10,4,10,5],[10,2,10,3],[1,1,1,4],[2,1,2,4],[3,1,3,4]]}
[]
[null,"Community Health Center Cost Report"]
[null,"Tab 4 - Non-Providers"]
[null,{"$f":"'1. Agency Information'!C9","v":0}]
[]
[null,"Please see accompanying Instructions document for guidance on data input."]
[]
[]
[]
[null,"Non-Provider Staff"]
{"$rows_left_out":308}
{"sheet":"5. Cost Information","index":5,"n_rows":63,"n_cols":26,"rows_kept":63,"cut":false,"hidden":false,"merged":[[1,1,1,4],[2,1,2,4],[3,1,3,4],[59,19,59,20],[9,1,9,2],[31,22,32,22],[21,1,21,2],[31,15,31,20],[31,3,31,13],[62,19,62,21]]}
[]
[null,"Community Health Center Cost Report"]
[null,"Tab 5 - Cost Information"]
[null,{"$f":"'1. Agency Information'!C9","v":0}]
[null,"Fringe Benefits"]
[]
[null,"Please see accompanying Instructions document for guidance on data input."]
[]
[]
["Line","Benefit",null,"Annual Benefit Amount","Percentage of Total Allowable and Non-Allowable Staff Costs"]
{"$rows_left_out":54}
{"sheet":"6. Reclass Template","index":6,"n_rows":63,"n_cols":12,"rows_kept":63,"cut":false,"hidden":false,"merged":[[1,1,1,4],[2,1,2,4],[3,1,3,4],[62,1,66,8],[8,3,8,5],[8,6,8,8],[8,2,9,2],[8,1,9,1]]}
[]
[null,"Community Health Center Cost Report"]
[null,"Tab 6 - Reclass Template"]
[null,{"$f":"'1. Agency Information'!C9","v":0}]
[]
[null,"Please see accompanying Instructions document for guidance on data input."]
[]
[]
[null,"Description of Reclassification(s)",null,"Increases",null,null,"Decreases"]
["Line",null,null,"Cost Center","Line #","Amount","Cost Center","Line #","Amount"]
{"$rows_left_out":54}
{"sheet":"7. Adjustment Template","index":7,"n_rows":29,"n_cols":9,"rows_kept":29,"cut":false,"hidden":false,"merged":[[8,1,8,5],[1,1,1,3],[2,1,2,3],[3,1,3,3]]}
[]
[null,"Community Health Center Cost Report"]
[null,"Tab 7 - Adjustment Template"]
[null,{"$f":"'1. Agency Information'!C9","v":0}]
[]
[null,"Please see accompanying Instructions document for guidance on data input."]
[null,"Note: Bad Debt should be reflected as a positive dollar value."]
[]
[null,"Adjustments to Expenses"]
["Line","Description of Adjustment to Expenses","Basis for Adjustment","Worksheet Line Number","Cost Center","Amount"]
{"$rows_left_out":20}
{"sheet":"8. Other Information","index":8,"n_rows":19,"n_cols":3,"rows_kept":19,"cut":false,"hidden":false,"merged":[[1,1,1,4],[2,1,2,4],[3,1,3,4]]}
[]
[null,"Community Health Center Cost Report"]
[null,"Tab 8 - Other Information"]
[null,{"$f":"'1. Agency Information'!C9","v":0}]
[null,"Facility Square Footage"]
[]
[]
["Line","Description of Area","Square Feet"]
[1,"Medical"]
[2,"Vision"]
{"$rows_left_out":10}
{"sheet":"Cost Breakdown","index":9,"n_rows":42,"n_cols":16,"rows_kept":42,"cut":false,"hidden":false,"merged":[[37,2,37,13],[29,2,29,13],[1,1,1,5],[2,1,2,5],[3,1,3,5]]}
[]
[null,"Community Health Center Cost Report"]
[null,"Cost Breakdown"]
[null,{"$f":"'1. Agency Information'!C9","v":0}]
[null,"Worksheet - Allocation of Costs by Services"]
[null,"Costs"]
[null,"Description","Tab","Totals","Medical","Behavioral Health & Substance Abuse","Dental","Laboratory","X-Ray","Pharmacy","Enabling","Admin","Facility","Non-Allowable",null,"Allocation Method"]
[]
[null,"Salaries - Provider",3,{"$f":"SUM($E$9:$N$9)","v":0},{"$f":"'3. Providers'!C58","v":0},{"$f":"'3. Providers'!C106","v":0},{"$f":"'3. Providers'!C70","v":0},null,null,null,null,null,null,null,null,"Direct"]
[null,"Salaries - Non-Provider",4,{"$f":"SUM($E$10:$N$10)","v":0},{"$f":"'4. Non-Providers'!C40","v":0},{"$f":"'4. Non-Providers'!C116","v":0},{"$f":"'4. Non-Providers'!C101","v":0},{"$f":"'4. Non-Providers'!C55","v":0},{"$f":"'4. Non-Providers'!C69","v":0},{"$f":"'4. Non-Providers'!C84","v":0},{"$f":"'4. Non-Providers'!C178","v":0},{"$f":"'4. Non-Providers'!C270","v":0},{"$f":"'4. Non-Providers'!C288","v":0},{"$f":"'4. Non-Providers'!C312","v":0},null,"Direct"]
{"$rows_left_out":33}
{"sheet":"Form 1 - Direct Medical Cost","index":10,"n_rows":49,"n_cols":12,"rows_kept":49,"cut":false,"hidden":false,"merged":[[7,5,9,5],[1,1,1,5],[2,1,2,5],[3,1,3,5]]}
[]
[null,"Community Health Center Cost Report"]
[null,"Form 1 - Direct Medical Cost"]
[null,{"$f":"'1. Agency Information'!C9","v":0}]
[]
["RECLASSIFICATIONS AND ADJUSTMENTS OF TRIAL BALANCE OF EXPENSES",null,null,null,null,null,null,null,null,null,null,"Form 1 (Direct Medical Care Cost)"]
[]
[null,null,null,null,null,"Compensation"," ",null,"","Reclassified","Adjustments","Net Expenses"]
["COST CENTER",null,null,"Salaried","Fringe",null,"Other",null,"Reclass-","Trial Balance","Increase","w Cost Changes"]
[null,null,null,"Personnel","Benefits",null,"Costs","Total","ifications","(Col 3 & 4)","(Decrease)","(Col 5 + 6)"]
{"$rows_left_out":40}
{"sheet":"Form 2 - Direct Dental Cost","index":11,"n_rows":40,"n_cols":12,"rows_kept":40,"cut":false,"hidden":false,"merged":[[7,5,9,5],[1,1,1,4],[2,1,2,4],[3,1,3,4]]}
[]
[null,"Community Health Center Cost Report"]
[null,"Form 2 - Direct Dental Cost"]
[null,{"$f":"'1. Agency Information'!C9","v":0}]
[]
["RECLASSIFICATIONS AND ADJUSTMENTS OF TRIAL BALANCE OF EXPENSES",null,null,null,null,null,null,null,null,null,null,"Form 2 (Direct Dental Care Cost)"]
[]
[null,null,null,null,null,"Compensation"," ",null,"","Reclassified","Adjustments","Net Expenses"]
["COST CENTER",null,null,"Salaried","Fringe",null,"Other",null,"Reclass-","Trial Balance","Increase","w Cost Changes"]
[null,null,null,"Personnel","Benefits",null,"Costs","Total","ifications","(Col 3 & 4)","(Decrease)","(Col 5 + 6)"]
{"$rows_left_out":31}
{"sheet":"Form 3 - Direct BH Cost","index":12,"n_rows":63,"n_cols":12,"rows_kept":63,"cut":false,"hidden":false,"merged":[[7,5,9,5],[1,1,1,4],[2,1,2,4],[3,1,3,4]]}
[]
[null,"Community Health Center Cost Report"]
[null,"Form 3 - Direct BH Cost"]
[null,{"$f":"'1. Agency Information'!C9","v":0}]
[]
["RECLASSIFICATIONS AND ADJUSTMENTS OF TRIAL BALANCE OF EXPENSES",null,null,null,null,null,null,null,null,null,null,"Form 3 (Direct Behavioral Health Care Cost)"]
[]
[null,null,null,null,null,"Compensation"," ",null,"","Reclassified","Adjustments","Net Expenses"]
["COST CENTER",null,null,"Salaried","Fringe",null,"Other",null,"Reclass-","Trial Balance","Increase","w Cost Changes"]
[null,null,null,"Personnel","Benefits",null,"Costs","Total","ifications","(Col 3 & 4)","(Decrease)","(Col 5 + 6)"]
{"$rows_left_out":54}
{"sheet":"Form 4 - NonAllowable","index":13,"n_rows":33,"n_cols":12,"rows_kept":33,"cut":false,"hidden":false,"merged":[[1,1,1,4],[2,1,2,4],[3,1,3,4]]}
[]
[null,"Community Health Center Cost Report"]
[null,"Form 4 - NonAllowable"]
[null,{"$f":"'1. Agency Information'!C9","v":0}]
[]
["RECLASSIFICATIONS AND ADJUSTMENTS OF TRIAL BALANCE OF EXPENSES",null,null,null,null,null,null,null,null,null,null,"Form 4 (Non-Allowable Other Direct Service Cost)"]
[]
[null,null,null,null,null,null," ",null,"","Reclassified","Adjustments","Net Expenses"]
["COST CENTER",null,null,"Salaried","Fringe",null,"Other",null,"Reclass-","Trial Balance","Increase","w Cost Changes"]
[null,null,null,"Personnel","Benefits","Compensation","Costs","Total","ifications","(Col 3 & 4)","(Decrease)","(Col 5 + 6)"]
{"$rows_left_out":24}
{"sheet":"Form 5 - Overhead & Enabling","index":14,"n_rows":76,"n_cols":12,"rows_kept":76,"cut":false,"hidden":false,"merged":[[7,5,9,5],[1,1,1,4],[2,1,2,4],[3,1,3,4]]}
[]
[null,"Community Health Center Cost Report"]
[null,"Form 5 - Overhead & Enabling"]
[null,{"$f":"'1. Agency Information'!C9","v":0}]
[]
["RECLASSIFICATIONS AND ADJUSTMENTS OF TRIAL BALANCE OF EXPENSES",null,null,null,null,null,null,null,null,null,null,"Form 5 (Overhead & Enabling Cost)"]
[]
[null,null,null,null,null,"Compensation"," ",null,"","Reclassified","Adjustments","Net Expenses"]
["COST CENTER",null,null,"Salaried","Fringe",null,"Other",null,"Reclass-","Trial Balance","Increase","w Cost Changes"]
[null,null,null,"Personnel","Benefits",null,"Costs","Total","ifications","(Col 3 & 4)","(Decrease)","(Col 5 + 6)"]
{"$rows_left_out":67}
{"sheet":"Form 6A - Reclassification","index":15,"n_rows":59,"n_cols":9,"rows_kept":59,"cut":false,"hidden":false,"merged":[[6,6,6,8],[6,1,7,1],[1,1,1,3],[2,1,2,3],[6,2,7,2],[6,3,6,5],[3,1,3,3]]}
[]
[null,"Community Health Center Cost Report"]
[null,"Form 6A - Reclassification"]
[null,{"$f":"'1. Agency Information'!C9","v":0}]
["RECLASSIFICATION OF TRIAL BALANCE OF EXPENSES",null,null,null,null,null,null,null,"Form 6A (Reclassification)"]
[]
[null,"Description of Reclassification(s)",null,"Increases",null,null,"Decreases"]
["Line",null,null,"Cost Center","Line #","Amount","Cost Center","Line #","Amount"]
[1,{"$f":"IF('6. Reclass Template'!B11 = 0, \"\", '6. Reclass Template'!B11)","v":""},{"$f":"IF('6. Reclass Template'!C11 = 0, \"\", '6. Reclass Template'!C11)","v":""},{"$f":"IF('6. Reclass Template'!D11 = 0, \"\", '6. Reclass Template'!D11)","v":""},{"$f":"IF('6. Reclass Template'!E11 = 0, \"\", '6. Reclass Template'!E11)","v":""},{"$f":"IF('6. Reclass Template'!F11 = 0, \"\", '6. Reclass Template'!F11)","v":""},{"$f":"IF('6. Reclass Template'!G11 = 0, \"\", '6. Reclass Template'!G11)","v":""},{"$f":"IF('6. Reclass Template'!H11 = 0, \"\", '6. Reclass Template'!H11)","v":""},{"$f":"IF('6. Reclass Template'!I11 = 0, \"\", '6. Reclass Template'!I11)","v":""}]
[2,{"$f":"IF('6. Reclass Template'!B12 = 0, \"\", '6. Reclass Template'!B12)","v":""},{"$f":"IF('6. Reclass Template'!C12 = 0, \"\", '6. Reclass Template'!C12)","v":""},{"$f":"IF('6. Reclass Template'!D12 = 0, \"\", '6. Reclass Template'!D12)","v":""},{"$f":"IF('6. Reclass Template'!E12 = 0, \"\", '6. Reclass Template'!E12)","v":""},{"$f":"IF('6. Reclass Template'!F12 = 0, \"\", '6. Reclass Template'!F12)","v":""},{"$f":"IF('6. Reclass Template'!G12 = 0, \"\", '6. Reclass Template'!G12)","v":""},{"$f":"IF('6. Reclass Template'!H12 = 0, \"\", '6. Reclass Template'!H12)","v":""},{"$f":"IF('6. Reclass Template'!I12 = 0, \"\", '6. Reclass Template'!I12)","v":""}]
{"$rows_left_out":50}
{"sheet":"Form 6B - Adjustments","index":16,"n_rows":27,"n_cols":9,"rows_kept":27,"cut":false,"hidden":false,"merged":[[6,1,6,5],[1,1,1,2],[2,1,2,2],[3,1,3,2]]}
[]
[null,"Community Health Center Cost Report"]
[null,"Form 6B - Adjustments"]
[null,{"$f":"'1. Agency Information'!C9","v":0}]
["ADJUSTMENT OF TRIAL BALANCE OF EXPENSES",null,null,null,null,"Form 6B (Adjustment)"]
[]
[null,"Adjustments to Expenses"]
["Line","Description of Adjustment to Expenses","Basis for Adjustment","Worksheet Line Number","Cost Center","Amount"]
[1,{"$f":"IF('7. Adjustment Template'!B11 = 0, \"\", '7. Adjustment Template'!B11)","v":"Bad Debt"},{"$f":"IF('7. Adjustment Template'!C11 = 0, \"\", '7. Adjustment Template'!C11)","v":""},{"$f":"IF('7. Adjustment Template'!D11 = 0, \"\", '7. Adjustment Template'!D11)","v":""},{"$f":"IF('7. Adjustment Template'!E11 = 0, \"\", '7. Adjustment Template'!E11)","v":""},{"$f":"IF('7. Adjustment Template'!F11 = 0, \"\", '7. Adjustment Template'!F11)","v":""},null,null,"Cost Center"]
[2,{"$f":"IF('7. Adjustment Template'!B12 = 0, \"\", '7. Adjustment Template'!B12)","v":""},{"$f":"IF('7. Adjustment Template'!C12 = 0, \"\", '7. Adjustment Template'!C12)","v":""},{"$f":"IF('7. Adjustment Template'!D12 = 0, \"\", '7. Adjustment Template'!D12)","v":""},{"$f":"IF('7. Adjustment Template'!E12 = 0, \"\", '7. Adjustment Template'!E12)","v":""},{"$f":"IF('7. Adjustment Template'!F12 = 0, \"\", '7. Adjustment Template'!F12)","v":""},null,"A","Medical"]
{"$rows_left_out":18}
{"sheet":"Form 7 - Visits by FTE","index":17,"n_rows":48,"n_cols":7,"rows_kept":48,"cut":false,"hidden":false,"merged":[[3,1,3,4],[8,0,9,2],[1,1,1,4],[2,1,2,4]]}
[]
[null,"Community Health Center Cost Report"]
[null,"Form 7 - Visits by FTE"]
[null,{"$f":"'1. Agency Information'!C9","v":0}]
[]
["HEALTH CARE VISITS AND FTEs BY PRACTITIONER",null,null,null,null,null,"Form 7 (Visits by FTE)"]
[]
[]
["HEALTH CARE VISITS AND FTEs",null,null,"Visits","Total"]
[null,null,null,null,"FTEs"]
{"$rows_left_out":39}
{"sheet":"Form A - Allocations","index":18,"n_rows":33,"n_cols":20,"rows_kept":33,"cut":false,"hidden":false,"merged":[[1,1,1,4],[2,1,2,4],[3,1,3,4],[27,1,27,2],[29,1,29,2],[10,1,10,2],[16,1,16,2],[22,1,22,2],[23,1,23,2]]}
[]
[null,"Community Health Center Cost Report"]
[null,"Form A - Allocations"]
[null,{"$f":"'1. Agency Information'!C9","v":0}]
[]
[null,null,null,null,null,null,null,null,null,null,null,null,null,null,null,null,null,null,null,"Form A (Statistical Basis/Allocations)"]
[]
["BASIS FOR ALLOCATIONS"]
[]
["Costs"]
{"$rows_left_out":24}
{"sheet":"Form B - Cost per Visit","index":19,"n_rows":20,"n_cols":4,"rows_kept":20,"cut":false,"hidden":false,"merged":[[11,1,11,2],[1,1,1,3],[2,1,2,3],[3,1,3,3]]}
[]
[null,"Community Health Center Cost Report"]
[null,"Form B - Cost per Visit"]
[null,{"$f":"'1. Agency Information'!C9","v":0}]
[]
[null,null,null,"Form B (Allowable Cost per Visit)"]
[]
["COST ADJUSTMENT AND ALLOCATION"]
[]
[]
{"$rows_left_out":11}
{"sheet":"Tab 9. Reconciliation","index":20,"n_rows":37,"n_cols":4,"rows_kept":37,"cut":false,"hidden":false,"merged":[[32,1,32,2],[36,1,36,2],[1,1,1,5],[2,1,2,5],[3,1,3,5],[7,1,7,2],[5,1,5,3],[13,1,13,2],[18,1,18,2],[23,1,23,2]]}
[]
[null,"Community Health Center Cost Report"]
[null,"Tab 9 - Reconciliation"]
[null,{"$f":"'1. Agency Information'!C9","v":0}]
[]
[null,"RECONCILIATION OF COST REPORT NET INCOME TO FINANCIAL STATEMENT (BOOK) NET INCOME"]
[]
["Line #","Cost Report Net Income"]
[1,"Total Cost Report Revenue (Tab 2, line 45)",{"$f":"ROUND('2. Revenue'!F57,0)","v":0}]
[2,"Total Cost Report Expenses (Form A, Line 18 plus Tab 7, Line 19)",{"$f":"ROUND(SUM('Form A - Allocations'!$D$33,'7. Adjustment Template'!$F$11),0)","v":0}]
{"$rows_left_out":28}
{"sheet":"Tab 10. Accuracy of Report","index":21,"n_rows":42,"n_cols":6,"rows_kept":42,"cut":false,"hidden":false,"merged":[[33,2,33,3],[35,2,35,3],[41,2,41,3],[28,2,28,3],[29,2,29,3],[37,2,37,3],[40,2,40,3],[38,2,38,3],[39,2,39,3],[34,2,34,3],[36,2,36,3],[31,2,31,3],[32,2,32,3],[22,2,22,6],[23,2,23,3],[24,2,24,3],[26,2,26,3],[27,2,27,3],[25,2,25,3],[1,1,1,5],[2,1,2,5],[3,2,3,4],[4,1,4,5],[5,2,5,5],[11,1,11,5],[6,2,6,5],[7,1,7,5],[8,2,8,5],[9,1,9,5],[10,1,10,5]]}
[]
[null,"Community Health Center Cost Report"]
[null,"Tab 10 - Accuracy of Report"]
[null,null,null,null,null,"R.5-0 Industries Inc."]
[null,{"$f":"'1. Agency Information'!B4","v":0}]
[]
[]
[null,"CERTIFICATION BY PROVIDER"]
[]
[null,"I declare and affirm under the penalties of perjury that this report thas been examined by me, and to the best of my knowledge and belief, is true and correct statement."]
{"$rows_left_out":33}
{"sheet":"Flat Data Tab","index":22,"n_rows":2,"n_cols":16,"rows_kept":2,"cut":false,"hidden":true,"merged":[]}
["CMS2 ID","MassHealth Provider ID","Provider Name","Fiscal Year Ending","Total Revenue","Total Expense","Financial Statement Total Revenue","Financial Statement Total Expense","Variance Between Cost Report and Financial Statements: Net Income","Total Reconciling Items","Medical + Behavioral Health Total Adjusted Allowable Costs","Medical + Behavioral Health Visits","Allowable Medical + BH Cost per Visit","Dental Total Adjusted Allowable Costs","Dental Visits","Allowable Dental Cost per Visit"]
[{"$f":"INDEX('Provider List'!$B:$B,MATCH($C2,'Provider List'!$C:$C,0))","v":{"$error":"#N/A"}},{"$f":"MassHealthProviderID","v":0},{"$f":"ProviderName","v":0},{"$f":"'1. Agency Information'!C18","v":"2023-12-31"},{"$f":"'Tab 9. Reconciliation'!C9","v":0},{"$f":"'Tab 9. Reconciliation'!C10","v":0},{"$f":"'Tab 9. Reconciliation'!C15","v":0},{"$f":"'Tab 9. Reconciliation'!C16","v":0},{"$f":"'Tab 9. Reconciliation'!C22","v":0},{"$f":"'Tab 9. Reconciliation'!D31","v":0},{"$f":"'Form B - Cost per Visit'!D14","v":0},{"$f":"'Form B - Cost per Visit'!D15","v":0},{"$f":"'Form B - Cost per Visit'!D16","v":""},{"$f":"'Form B - Cost per Visit'!D18","v":0},{"$f":"'Form B - Cost per Visit'!D19","v":0},{"$f":"'Form B - Cost per Visit'!D20","v":""}]

{"sheet":"Provider List","index":23,"n_rows":38,"n_cols":3,"rows_kept":38,"cut":false,"hidden":true,"merged":[]}
[]
[]
[null,"CMS2 ID","Provider Name"]
[null,"-"]
[null,15,"Boston Health Care for the Homeless Program"]
[null,26,"Brockton Neighborhood Health Center"]
[null,125,"Caring Health Center, Inc."]
[null,80,"Charles River Community Health"]
[null,6798,"Community Health Center of Cape Cod"]
[null,3104,"Community Health Center of Franklin County"]
{"$rows_left_out":29}
{"sheet":"System Data","index":24,"n_rows":27,"n_cols":2,"rows_kept":27,"cut":false,"hidden":true,"merged":[]}
[{"$f":"IF(OR(ProviderName <> 0,ProviderName <> \"\"), (INDEX('Provider List'!B4:B60, MATCH(ProviderName,'Provider List'!C4:C60,0),0)), 0)","v":0},"OrgID"]
[{"$f":"MassHealthProviderID","v":0},"MassHealthID"]
[{"$f":"'1. Agency Information'!C18","v":"2023-12-31"},"FiscalYear"]
[true,"OnSaveFlag"]
[{"$f":"ProviderName","v":0},"vProviderName"]
[1,"TemplateVersion"]
[{"$f":"OrgID&\"_\"&vProviderName&\"_CHCCRFY\"&RIGHT(YEAR(FiscalYear),2)&\".xlsm\"","v":"0_0_CHCCRFY23.xlsm"},"vFileName"]
[{"$f":"IF(AND(A9,A10,A11,A12,A13,A14,A15,A16,A17,A18,A19,A20,A21,A22,A23,A24,A25,A26,A27),TRUE,FALSE)","v":false},"vRequiredFields"]
[{"$f":"IF('Tab 10. Accuracy of Report'!E24=\"No Action Required\",TRUE,FALSE)","v":false},"vRequiredFieldE24"]
[{"$f":"IF('Tab 10. Accuracy of Report'!E25=\"No Action Required\",TRUE,FALSE)","v":false},"vRequiredFieldE25"]
{"$rows_left_out":17}